For all issues regarding the Forums use, please, refer to the Forum Rules.

Our Solutions

Need professional assistance?
Consider our:

Support Offerings

 

Need to speed up your development?
Have a look at our:

Samples & Tools

 

Need some functionality extending standard OCCT capabilities?
Check out our:

Adv. Components

Related pages

error: ‘class IGESControl_Reader’ has no member named ‘Check’

Game Milky's picture
Forums: 

Dear All,
I using OCCT652, and i try to import IGES file in using OCCT652 and would like to check the inport! But i got the following error while using Standard_Boolean ok = reader.Check(Standard_True) and reader.PrintCheckLoad (failsonly, mode);
Error message:

main.cpp:31:30: error: ‘class IGESControl_Reader’ has no member named ‘Check’
main.cpp:32:24: error: ‘failsonly’ was not declared in this scope
main.cpp:32:35: error: ‘mode’ was not declared in this scope
main.cpp:26:28: warning: unused variable ‘stat’ [-Wunused-variable]
main.cpp:31:18: warning: unused variable ‘ok’ [-Wunused-variable]
make[1]: *** [debug/main.o] Error 1

what class member I need to use to make understand 'Check' and faisonly!

thanks for the help